{"text_format":"3","workbook":"xlsx","n_sheets":7,"sheets":["优秀学生干部","优秀团员","优秀青年志愿者","文体活动先进个人","社会实践先进工作者","社会实践优秀个人","社会实践先进个人"],"not_rendered":{"external_links":3,"defined_names":1},"read":"whole","date_system":"1900"}

{"sheet":"优秀学生干部","index":0,"n_rows":374,"n_cols":8,"rows_kept":374,"merged":[[0,0,0,7],[1,0,1,7]]}
["中国石油大学2022-2023学年学生组织优秀学生干部"]
["校级学生组织和校级学生社团由校团委负责评定。校级学生组织根据组织人数确定名额，数量为4—8人不等，校级学生社团优干指标标准根据2022-2023学年社团考核结果执行：五星级社团4人、四星级社团2人、三星级社团1人，二星、一星社团无。院级学生组织和社团由院团委负责评定。具体评定条件参见《学生手册》。被评为优秀学生干部的，在“志愿北京”中登记志愿时长不得少于20小时。团委所评定优干指标，不能与学工处下发到班级的优干指标兼得，否则浪费指标,不予补报。"]
["序号","姓名","学号","学历（本/研）","学院/研究院（全称）","专业年级","组织名称","备注"]
[1,"王栋",2021010020,"本","地球科学学院","资源勘查工程21级","校团委办公室"]
[2,"陈雨萌",2022012276,"本","碳中和未来技术学院","碳储科学与工程22级","校团委办公室"]
[3,"丁彬",2022010838,"本","机械与储运工程学院","机械设计制造及自动化22级","校团委办公室"]
[4,"江锦欣",2022010422,"本","化学工程与环境学院","化学工程与工艺22级","校团委办公室"]
[5,"夏小迪",2022011888,"本","经济管理学院","能源经济22级","校团委办公室"]
{"$rows_left_out":367}
{"sheet":"优秀团员","index":1,"n_rows":554,"n_cols":6,"rows_kept":554,"merged":[[0,0,0,5],[1,0,1,5]]}
["中国石油大学2022-2023学年优秀团员"]
["本科二年级及以上在本科生可参评优秀团员，优秀团员数量不得高于总团员数得10%（以“北京共青团”系统记录\n团员数为准）。基本条件：体能测试及格综合测评专业前30%，未受过纪律处分。年度团员评议结果需为“优”，\n“志愿北京”中登记志愿时长不少于20小时。各学院需严格审核条件，未满28周岁的学生党员可参评此荣誉称号。"]
["序号","姓名","学号","学院/研究院（全称）","专业年级","备注"]
["1","杨子涵",2021010007,"地球科学学院","地质学2021级"]
["2","黄祺智",2022010026,"地球科学学院","地质学2022级"]
["3","赵柯欣",2021010127,"地球科学学院","地质学2021级"]
["4","杨荣彬",2021010152,"地球科学学院","地质学2021级"]
["5","史国梁",2020010110,"地球科学学院","资源勘查工程2020级"]
{"$rows_left_out":547}
{"sheet":"优秀青年志愿者","index":2,"n_rows":285,"n_cols":7,"rows_kept":285,"merged":[[0,0,0,6],[1,0,1,6]]}
["中国石油大学2022-2023学年优秀青年志愿者"]
["本科二年级以上在校生可参评，本学院在“志愿北京”录入志愿服务时长大于24小时的可参评，一等奖占符合条件人数的1%，二等奖占符合条件人数的4%。"]
["序号","姓名","学号","学历（本/研）","学院/研究院（全称）","专业年级","奖学金等级（一等奖/二等奖）"]
[1,"刘宗毅","2021215034","研","地球科学学院","地研21级","一等奖"]
[2,"王伟浩","2022215076","研","地球科学学院","地研22级","一等奖"]
[3,"张泽",2021210064,"研","地球科学学院","地研21级","一等奖"]
[4,"郑伟",2021215018,"研","地球科学学院","地研21级","一等奖"]
[5,"孙笑凡",2021210110,"研","地球科学学院","地研21级","一等奖"]
{"$rows_left_out":278}
{"sheet":"文体活动先进个人","index":3,"n_rows":906,"n_cols":10,"rows_kept":906,"merged":[[0,0,0,9],[361,6,371,6],[372,6,373,6],[374,6,377,6],[378,6,383,6],[384,6,386,6],[387,6,388,6],[390,6,393,6],[396,6,407,6],[408,6,411,6],[412,6,415,6],[416,6,419,6],[420,6,424,6],[425,6,429,6],[430,6,434,6],[435,6,442,6],[531,34,531,45],[531,46,531,57],[531,58,531,69],[531,70,531,81],[531,82,531,93],[531,94,531,105],[531,106,531,117],[531,118,531,129],[531,130,531,141],[531,142,531,153],[531,154,531,165],[531,166,531,177],[531,178,531,189],[531,190,531,201],[531,202,531,213],[531,214,531,225],[531,226,531,237],[531,238,531,249],[531,250,531,261],[531,262,531,273],[531,274,531,285],[531,286,531,297],[531,298,531,309],[531,310,531,321],[531,322,531,333],[531,334,531,345],[531,346,531,357],[531,358,531,369],[531,370,531,381],[531,382,531,393],[531,394,531,405],[531,406,531,417],[531,418,531,429],[531,430,531,441],[531,442,531,453],[531,454,531,465],[531,466,531,477],[531,478,531,489],[531,490,531,501],[531,502,531,513],[531,514,531,525],[531,526,531,537],[531,538,531,549],[531,550,531,561],[531,562,531,573],[531,574,531,585],[531,586,531,597],[531,598,531,609],[531,610,531,621],[531,622,531,633],[531,634,531,645],[531,646,531,657],[531,658,531,669],[531,670,531,681],[531,682,531,693],[531,694,531,705],[531,706,531,717],[531,718,531,729],[531,730,531,741],[531,742,531,753],[531,754,531,765],[531,766,531,777],[531,778,531,789],[531,790,531,801],[531,802,531,813],[531,814,531,825],[531,826,531,837],[531,838,531,849],[531,850,531,861],[531,862,531,873],[531,874,531,885],[531,886,531,897],[531,898,531,909],[531,910,531,921],[531,922,531,933],[531,934,531,945],[531,946,531,957],[531,958,531,969],[531,970,531,981],[531,982,531,993],[531,994,531,1005],[531,1006,531,1017],[531,1018,531,1029],[531,1030,531,1041],[531,1042,531,1053],[531,1054,531,1065],[531,1066,531,1077],[531,1078,531,1089],[531,1090,531,1101],[531,1102,531,1113],[531,1114,531,1125],[531,1126,531,1137],[531,1138,531,1149],[531,1150,531,1161],[531,1162,531,1173],[531,1174,531,1185],[531,1186,531,1197],[531,1198,531,1209],[531,1210,531,1221],[531,1222,531,1233],[531,1234,531,1245],[531,1246,531,1257],[531,1258,531,1269],[531,1270,531,1281],[531,1282,531,1293],[531,1294,531,1305],[531,1306,531,1317],[531,1318,531,1329],[531,1330,531,1341],[531,1342,531,1353],[531,1354,531,1365],[531,1366,531,1377],[531,1378,531,1389],[531,1390,531,1401],[531,1402,531,1413],[531,1414,531,1425],[531,1426,531,1437],[531,1438,531,1449],[531,1450,531,1461],[531,1462,531,1473],[531,1474,531,1485],[531,1486,531,1497],[531,1498,531,1509],[531,1510,531,1521],[531,1522,531,1533],[531,1534,531,1545],[531,1546,531,1557],[531,1558,531,1569],[531,1570,531,1581],[531,1582,531,1593],[531,1594,531,1605],[531,1606,531,1617],[531,1618,531,1629],[531,1630,531,1641],[531,1642,531,1653],[531,1654,531,1665],[531,1666,531,1677],[531,1678,531,1689],[531,1690,531,1701],[531,1702,531,1713],[531,1714,531,1725],[531,1726,531,1737],[531,1738,531,1749],[531,1750,531,1761],[531,1762,531,1773],[531,1774,531,1785],[531,1786,531,1797],[531,1798,531,1809],[531,1810,531,1821],[531,1822,531,1833],[531,1834,531,1845],[531,1846,531,1857],[531,1858,531,1869],[531,1870,531,1881],[531,1882,531,1893],[531,1894,531,1905],[531,1906,531,1917],[531,1918,531,1929],[531,1930,531,1941],[531,1942,531,1953],[531,1954,531,1965],[531,1966,531,1977],[531,1978,531,1989],[531,1990,531,2001],[531,2002,531,2013],[531,2014,531,2025],[531,2026,531,2037],[531,2038,531,2049],[531,2050,531,2061],[531,2062,531,2073],[531,2074,531,2085],[531,2086,531,2097],[531,2098,531,2109],[531,2110,531,2121],[531,2122,531,2133],[531,2134,531,2145],[531,2146,531,2157],[531,2158,531,2169],[531,2170,531,2181],[531,2182,531,2193],[531,2194,531,2205],[531,2206,531,2217],[531,2218,531,2229],[531,2230,531,2241],[531,2242,531,2253],[531,2254,531,2265],[531,2266,531,2277],[531,2278,531,2289],[531,2290,531,2301],[531,2302,531,2313],[531,2314,531,2325],[531,2326,531,2337],[531,2338,531,2349],[531,2350,531,2361],[531,2362,531,2373],[531,2374,531,2385],[531,2386,531,2397],[531,2398,531,2409],[531,2410,531,2421],[531,2422,531,2433],[531,2434,531,2445],[531,2446,531,2457],[531,2458,531,2469],[531,2470,531,2481],[531,2482,531,2493],[531,2494,531,2505],[531,2506,531,2517],[531,2518,531,2529],[531,2530,531,2541],[531,2542,531,2553],[531,2554,531,2565],[531,2566,531,2577],[531,2578,531,2589],[531,2590,531,2601],[531,2602,531,2613],[531,2614,531,2625],[531,2626,531,2637],[531,2638,531,2649],[531,2650,531,2661],[531,2662,531,2673],[531,2674,531,2685],[531,2686,531,2697],[531,2698,531,2709],[531,2710,531,2721],[531,2722,531,2733],[531,2734,531,2745],[531,2746,531,2757],[531,2758,531,2769],[531,2770,531,2781],[531,2782,531,2793],[531,2794,531,2805],[531,2806,531,2817],[531,2818,531,2829],[531,2830,531,2841],[531,2842,531,2853],[531,2854,531,2865],[531,2866,531,2877],[531,2878,531,2889],[531,2890,531,2901],[531,2902,531,2913],[531,2914,531,2925],[531,2926,531,2937],[531,2938,531,2949],[531,2950,531,2961],[531,2962,531,2973],[531,2974,531,2985],[531,2986,531,2997],[531,2998,531,3009],[531,3010,531,3021],[531,3022,531,3033],[531,3034,531,3045],[531,3046,531,3057],[531,3058,531,3069],[531,3070,531,3081],[531,3082,531,3093],[531,3094,531,3105],[531,3106,531,3117],[531,3118,531,3129],[531,3130,531,3141],[531,3142,531,3153],[531,3154,531,3165],[531,3166,531,3177],[531,3178,531,3189],[531,3190,531,3201],[531,3202,531,3213],[531,3214,531,3225],[531,3226,531,3237],[531,3238,531,3249],[531,3250,531,3261],[531,3262,531,3273],[531,3274,531,3285],[531,3286,531,3297],[531,3298,531,3309],[531,3310,531,3321],[531,3322,531,3333],[531,3334,531,3345],[531,3346,531,3357],[531,3358,531,3369],[531,3370,531,3381],[531,3382,531,3393],[531,3394,531,3405],[531,3406,531,3417],[531,3418,531,3429],[531,3430,531,3441],[531,3442,531,3453],[531,3454,531,3465],[531,3466,531,3477],[531,3478,531,3489],[531,3490,531,3501],[531,3502,531,3513],[531,3514,531,3525],[531,3526,531,3537],[531,3538,531,3549],[531,3550,531,3561],[531,3562,531,3573],[531,3574,531,3585],[531,3586,531,3597],[531,3598,531,3609],[531,3610,531,3621],[531,3622,531,3633],[531,3634,531,3645],[531,3646,531,3657],[531,3658,531,3669],[531,3670,531,3681],[531,3682,531,3693],[531,3694,531,3705],[531,3706,531,3717],[531,3718,531,3729],[531,3730,531,3741],[531,3742,531,3753],[531,3754,531,3765],[531,3766,531,3777],[531,3778,531,3789],[531,3790,531,3801],[531,3802,531,3813],[531,3814,531,3825],[531,3826,531,3837],[531,3838,531,3849],[531,3850,531,3861],[531,3862,531,3873],[531,3874,531,3885],[531,3886,531,3897],[531,3898,531,3909],[531,3910,531,3921],[531,3922,531,3933],[531,3934,531,3945],[531,3946,531,3957],[531,3958,531,3969],[531,3970,531,3981],[531,3982,531,3993],[531,3994,531,4005],[531,4006,531,4017],[531,4018,531,4029],[531,4030,531,4041],[531,4042,531,4053],[531,4054,531,4065],[531,4066,531,4077],[531,4078,531,4089],[531,4090,531,4101],[531,4102,531,4113],[531,4114,531,4125],[531,4126,531,4137],[531,4138,531,4149],[531,4150,531,4161],[531,4162,531,4173],[531,4174,531,4185],[531,4186,531,4197],[531,4198,531,4209],[531,4210,531,4221],[531,4222,531,4233],[531,4234,531,4245],[531,4246,531,4257],[531,4258,531,4269],[531,4270,531,4281],[531,4282,531,4293],[531,4294,531,4305],[531,4306,531,4317],[531,4318,531,4329],[531,4330,531,4341],[531,4342,531,4353],[531,4354,531,4365],[531,4366,531,4377],[531,4378,531,4389],[531,4390,531,4401],[531,4402,531,4413],[531,4414,531,4425],[531,4426,531,4437],[531,4438,531,4449],[531,4450,531,4461],[531,4462,531,4473],[531,4474,531,4485],[531,4486,531,4497],[531,4498,531,4509],[531,4510,531,4521],[531,4522,531,4533],[531,4534,531,4545],[531,4546,531,4557],[531,4558,531,4569],[531,4570,531,4581],[531,4582,531,4593],[531,4594,531,4605],[531,4606,531,4617],[531,4618,531,4629],[531,4630,531,4641],[531,4642,531,4653],[531,4654,531,4665],[531,4666,531,4677],[531,4678,531,4689],[531,4690,531,4701],[531,4702,531,4713],[531,4714,531,4725],[531,4726,531,4737],[531,4738,531,4749],[531,4750,531,4761],[531,4762,531,4773],[531,4774,531,4785],[531,4786,531,4797],[531,4798,531,4809],[531,4810,531,4821],[531,4822,531,4833],[531,4834,531,4845],[531,4846,531,4857],[531,4858,531,4869],[531,4870,531,4881],[531,4882,531,4893],[531,4894,531,4905],[531,4906,531,4917],[531,4918,531,4929],[531,4930,531,4941],[531,4942,531,4953],[531,4954,531,4965],[531,4966,531,4977],[531,4978,531,4989],[531,4990,531,5001],[531,5002,531,5013],[531,5014,531,5025],[531,5026,531,5037],[531,5038,531,5049],[531,5050,531,5061],[531,5062,531,5073],[531,5074,531,5085],[531,5086,531,5097],[531,5098,531,5109],[531,5110,531,5121],[531,5122,531,5133],[531,5134,531,5145],[531,5146,531,5157],[531,5158,531,5169],[531,5170,531,5181],[531,5182,531,5193],[531,5194,531,5205],[531,5206,531,5217],[531,5218,531,5229],[531,5230,531,5241],[531,5242,531,5253],[531,5254,531,5265],[531,5266,531,5277],[531,5278,531,5289],[531,5290,531,5301],[531,5302,531,5313],[531,5314,531,5325],[531,5326,531,5337],[531,5338,531,5349],[531,5350,531,5361],[531,5362,531,5373],[531,5374,531,5385],[531,5386,531,5397],[531,5398,531,5409],[531,5410,531,5421],[531,5422,531,5433],[531,5434,531,5445],[531,5446,531,5457],[531,5458,531,5469],[531,5470,531,5481],[531,5482,531,5493],[531,5494,531,5505],[531,5506,531,5517],[531,5518,531,5529],[531,5530,531,5541],[531,5542,531,5553],[531,5554,531,5565],[531,5566,531,5577],[531,5578,531,5589],[531,5590,531,5601],[531,5602,531,5613],[531,5614,531,5625],[531,5626,531,5637],[531,5638,531,5649],[531,5650,531,5661],[531,5662,531,5673],[531,5674,531,5685],[531,5686,531,5697],[531,5698,531,5709],[531,5710,531,5721],[531,5722,531,5733],[531,5734,531,5745],[531,5746,531,5757],[531,5758,531,5769],[531,5770,531,5781],[531,5782,531,5793],[531,5794,531,5805],[531,5806,531,5817],[531,5818,531,5829],[531,5830,531,5841],[531,5842,531,5853],[531,5854,531,5865],[531,5866,531,5877],[531,5878,531,5889],[531,5890,531,5901],[531,5902,531,5913],[531,5914,531,5925],[531,5926,531,5937],[531,5938,531,5949],[531,5950,531,5961],[531,5962,531,5973],[531,5974,531,5985],[531,5986,531,5997],[531,5998,531,6009],[531,6010,531,6021],[531,6022,531,6033],[531,6034,531,6045],[531,6046,531,6057],[531,6058,531,6069],[531,6070,531,6081],[531,6082,531,6093],[531,6094,531,6105],[531,6106,531,6117],[531,6118,531,6129],[531,6130,531,6141],[531,6142,531,6153],[531,6154,531,6165],[531,6166,531,6177],[531,6178,531,6189],[531,6190,531,6201],[531,6202,531,6213],[531,6214,531,6225],[531,6226,531,6237],[531,6238,531,6249],[531,6250,531,6261],[531,6262,531,6273],[531,6274,531,6285],[531,6286,531,6297],[531,6298,531,6309],[531,6310,531,6321],[531,6322,531,6333],[531,6334,531,6345],[531,6346,531,6357],[531,6358,531,6369],[531,6370,531,6381],[531,6382,531,6393],[531,6394,531,6405],[531,6406,531,6417],[531,6418,531,6429],[531,6430,531,6441],[531,6442,531,6453],[531,6454,531,6465],[531,6466,531,6477],[531,6478,531,6489],[531,6490,531,6501],[531,6502,531,6513],[531,6514,531,6525],[531,6526,531,6537],[531,6538,531,6549],[531,6550,531,6561],[531,6562,531,6573],[531,6574,531,6585],[531,6586,531,6597],[531,6598,531,6609],[531,6610,531,6621],[531,6622,531,6633],[531,6634,531,6645],[531,6646,531,6657],[531,6658,531,6669],[531,6670,531,6681],[531,6682,531,6693],[531,6694,531,6705],[531,6706,531,6717],[531,6718,531,6729],[531,6730,531,6741],[531,6742,531,6753],[531,6754,531,6765],[531,6766,531,6777],[531,6778,531,6789],[531,6790,531,6801],[531,6802,531,6813],[531,6814,531,6825],[531,6826,531,6837],[531,6838,531,6849],[531,6850,531,6861],[531,6862,531,6873],[531,6874,531,6885],[531,6886,531,6897],[531,6898,531,6909],[531,6910,531,6921],[531,6922,531,6933],[531,6934,531,6945],[531,6946,531,6957],[531,6958,531,6969],[531,6970,531,6981],[531,6982,531,6993],[531,6994,531,7005],[531,7006,531,7017],[531,7018,531,7029],[531,7030,531,7041],[531,7042,531,7053],[531,7054,531,7065],[531,7066,531,7077],[531,7078,531,7089],[531,7090,531,7101],[531,7102,531,7113],[531,7114,531,7125],[531,7126,531,7137],[531,7138,531,7149],[531,7150,531,7161],[531,7162,531,7173],[531,7174,531,7185],[531,7186,531,7197],[531,7198,531,7209],[531,7210,531,7221],[531,7222,531,7233],[531,7234,531,7245],[531,7246,531,7257],[531,7258,531,7269],[531,7270,531,7281],[531,7282,531,7293],[531,7294,531,7305],[531,7306,531,7317],[531,7318,531,7329],[531,7330,531,7341],[531,7342,531,7353],[531,7354,531,7365],[531,7366,531,7377],[531,7378,531,7389],[531,7390,531,7401],[531,7402,531,7413],[531,7414,531,7425],[531,7426,531,7437],[531,7438,531,7449],[531,7450,531,7461],[531,7462,531,7473],[531,7474,531,7485],[531,7486,531,7497],[531,7498,531,7509],[531,7510,531,7521],[531,7522,531,7533],[531,7534,531,7545],[531,7546,531,7557],[531,7558,531,7569],[531,7570,531,7581],[531,7582,531,7593],[531,7594,531,7605],[531,7606,531,7617],[531,7618,531,7629],[531,7630,531,7641],[531,7642,531,7653],[531,7654,531,7665],[531,7666,531,7677],[531,7678,531,7689],[531,7690,531,7701],[531,7702,531,7713],[531,7714,531,7725],[531,7726,531,7737],[531,7738,531,7749],[531,7750,531,7761],[531,7762,531,7773],[531,7774,531,7785],[531,7786,531,7797],[531,7798,531,7809],[531,7810,531,7821],[531,7822,531,7833],[531,7834,531,7845],[531,7846,531,7857],[531,7858,531,7869],[531,7870,531,7881],[531,7882,531,7893],[531,7894,531,7905],[531,7906,531,7917],[531,7918,531,7929],[531,7930,531,7941],[531,7942,531,7953],[531,7954,531,7965],[531,7966,531,7977],[531,7978,531,7989],[531,7990,531,8001],[531,8002,531,8013],[531,8014,531,8025],[531,8026,531,8037],[531,8038,531,8049],[531,8050,531,8061],[531,8062,531,8073],[531,8074,531,8085],[531,8086,531,8097],[531,8098,531,8109],[531,8110,531,8121],[531,8122,531,8133],[531,8134,531,8145],[531,8146,531,8157],[531,8158,531,8169],[531,8170,531,8181],[531,8182,531,8193],[531,8194,531,8205],[531,8206,531,8217],[531,8218,531,8229],[531,8230,531,8241],[531,8242,531,8253],[531,8254,531,8265],[531,8266,531,8277],[531,8278,531,8289],[531,8290,531,8301],[531,8302,531,8313],[531,8314,531,8325],[531,8326,531,8337],[531,8338,531,8349],[531,8350,531,8361],[531,8362,531,8373],[531,8374,531,8385],[531,8386,531,8397],[531,8398,531,8409],[531,8410,531,8421],[531,8422,531,8433],[531,8434,531,8445],[531,8446,531,8457],[531,8458,531,8469],[531,8470,531,8481],[531,8482,531,8493],[531,8494,531,8505],[531,8506,531,8517],[531,8518,531,8529],[531,8530,531,8541],[531,8542,531,8553],[531,8554,531,8565],[531,8566,531,8577],[531,8578,531,8589],[531,8590,531,8601],[531,8602,531,8613],[531,8614,531,8625],[531,8626,531,8637],[531,8638,531,8649],[531,8650,531,8661],[531,8662,531,8673],[531,8674,531,8685],[531,8686,531,8697],[531,8698,531,8709],[531,8710,531,8721],[531,8722,531,8733],[531,8734,531,8745],[531,8746,531,8757],[531,8758,531,8769],[531,8770,531,8781],[531,8782,531,8793],[531,8794,531,8805],[531,8806,531,8817],[531,8818,531,8829],[531,8830,531,8841],[531,8842,531,8853],[531,8854,531,8865],[531,8866,531,8877],[531,8878,531,8889],[531,8890,531,8901],[531,8902,531,8913],[531,8914,531,8925],[531,8926,531,8937],[531,8938,531,8949],[531,8950,531,8961],[531,8962,531,8973],[531,8974,531,8985],[531,8986,531,8997],[531,8998,531,9009],[531,9010,531,9021],[531,9022,531,9033],[531,9034,531,9045],[531,9046,531,9057],[531,9058,531,9069],[531,9070,531,9081],[531,9082,531,9093],[531,9094,531,9105],[531,9106,531,9117],[531,9118,531,9129],[531,9130,531,9141],[531,9142,531,9153],[531,9154,531,9165],[531,9166,531,9177],[531,9178,531,9189],[531,9190,531,9201],[531,9202,531,9213],[531,9214,531,9225],[531,9226,531,9237],[531,9238,531,9249],[531,9250,531,9261],[531,9262,531,9273],[531,9274,531,9285],[531,9286,531,9297],[531,9298,531,9309],[531,9310,531,9321],[531,9322,531,9333],[531,9334,531,9345],[531,9346,531,9357],[531,9358,531,9369],[531,9370,531,9381],[531,9382,531,9393],[531,9394,531,9405],[531,9406,531,9417],[531,9418,531,9429],[531,9430,531,9441],[531,9442,531,9453],[531,9454,531,9465],[531,9466,531,9477],[531,9478,531,9489],[531,9490,531,9501],[531,9502,531,9513],[531,9514,531,9525],[531,9526,531,9537],[531,9538,531,9549],[531,9550,531,9561],[531,9562,531,9573],[531,9574,531,9585],[531,9586,531,9597],[531,9598,531,9609],[531,9610,531,9621],[531,9622,531,9633],[531,9634,531,9645],[531,9646,531,9657],[531,9658,531,9669],[531,9670,531,9681],[531,9682,531,9693],[531,9694,531,9705],[531,9706,531,9717],[531,9718,531,9729],[531,9730,531,9741],[531,9742,531,9753],[531,9754,531,9765],[531,9766,531,9777],[531,9778,531,9789],[531,9790,531,9801],[531,9802,531,9813],[531,9814,531,9825],[531,9826,531,9837],[531,9838,531,9849],[531,9850,531,9861],[531,9862,531,9873],[531,9874,531,9885],[531,9886,531,9897],[531,9898,531,9909],[531,9910,531,9921],[531,9922,531,9933],[531,9934,531,9945],[531,9946,531,9957],[531,9958,531,9969],[531,9970,531,9981],[531,9982,531,9993],[531,9994,531,10005],[531,10006,531,10017],[531,10018,531,10029],[531,10030,531,10041],[531,10042,531,10053],[531,10054,531,10065],[531,10066,531,10077],[531,10078,531,10089],[531,10090,531,10101],[531,10102,531,10113],[531,10114,531,10125],[531,10126,531,10137],[531,10138,531,10149],[531,10150,531,10161],[531,10162,531,10173],[531,10174,531,10185],[531,10186,531,10197],[531,10198,531,10209],[531,10210,531,10221],[531,10222,531,10233],[531,10234,531,10245],[531,10246,531,10257],[531,10258,531,10269],[531,10270,531,10281],[531,10282,531,10293],[531,10294,531,10305],[531,10306,531,10317],[531,10318,531,10329],[531,10330,531,10341],[531,10342,531,10353],[531,10354,531,10365],[531,10366,531,10377],[531,10378,531,10389],[531,10390,531,10401],[531,10402,531,10413],[531,10414,531,10425],[531,10426,531,10437],[531,10438,531,10449],[531,10450,531,10461],[531,10462,531,10473],[531,10474,531,10485],[531,10486,531,10497],[531,10498,531,10509],[531,10510,531,10521],[531,10522,531,10533],[531,10534,531,10545],[531,10546,531,10557],[531,10558,531,10569],[531,10570,531,10581],[531,10582,531,10593],[531,10594,531,10605],[531,10606,531,10617],[531,10618,531,10629],[531,10630,531,10641],[531,10642,531,10653],[531,10654,531,10665],[531,10666,531,10677],[531,10678,531,10689],[531,10690,531,10701],[531,10702,531,10713],[531,10714,531,10725],[531,10726,531,10737],[531,10738,531,10749],[531,10750,531,10761],[531,10762,531,10773],[531,10774,531,10785],[531,10786,531,10797],[531,10798,531,10809],[531,10810,531,10821],[531,10822,531,10833],[531,10834,531,10845],[531,10846,531,10857],[531,10858,531,10869],[531,10870,531,10881],[531,10882,531,10893],[531,10894,531,10905],[531,10906,531,10917],[531,10918,531,10929],[531,10930,531,10941],[531,10942,531,10953],[531,10954,531,10965],[531,10966,531,10977],[531,10978,531,10989],[531,10990,531,11001],[531,11002,531,11013],[531,11014,531,11025],[531,11026,531,11037],[531,11038,531,11049],[531,11050,531,11061],[531,11062,531,11073],[531,11074,531,11085],[531,11086,531,11097],[531,11098,531,11109],[531,11110,531,11121],[531,11122,531,11133],[531,11134,531,11145],[531,11146,531,11157],[531,11158,531,11169],[531,11170,531,11181],[531,11182,531,11193],[531,11194,531,11205],[531,11206,531,11217],[531,11218,531,11229],[531,11230,531,11241],[531,11242,531,11253],[531,11254,531,11265],[531,11266,531,11277],[531,11278,531,11289],[531,11290,531,11301],[531,11302,531,11313],[531,11314,531,11325],[531,11326,531,11337],[531,11338,531,11349],[531,11350,531,11361],[531,11362,531,11373],[531,11374,531,11385],[531,11386,531,11397],[531,11398,531,11409],[531,11410,531,11421],[531,11422,531,11433],[531,11434,531,11445],[531,11446,531,11457],[531,11458,531,11469],[531,11470,531,11481],[531,11482,531,11493],[531,11494,531,11505],[531,11506,531,11517],[531,11518,531,11529],[531,11530,531,11541],[531,11542,531,11553],[531,11554,531,11565],[531,11566,531,11577],[531,11578,531,11589],[531,11590,531,11601],[531,11602,531,11613],[531,11614,531,11625],[531,11626,531,11637],[531,11638,531,11649],[531,11650,531,11661],[531,11662,531,11673],[531,11674,531,11685],[531,11686,531,11697],[531,11698,531,11709],[531,11710,531,11721],[531,11722,531,11733],[531,11734,531,11745],[531,11746,531,11757],[531,11758,531,11769],[531,11770,531,11781],[531,11782,531,11793],[531,11794,531,11805],[531,11806,531,11817],[531,11818,531,11829],[531,11830,531,11841]],"merged_total":8745,"flags":["merged_cut"]}
["中国石油大学2022-2023学年文体活动先进个人"]
["参加北京市（即省部级）及以上文艺或体育比赛，成绩优秀，为学校争得荣誉或为学校文体工作做出较大贡献的（文艺需获一、二、三等奖，体育需获前八名，体育特长生不参加此项评选）可获得此项荣誉。具体评选由文体学院负责，大学生艺术团获奖部分由校团委负责。"]
[]
[]
["序号","姓名","学号","学历（本/研）","学院/研究院","专业年级","赛事名称","赛事级别","项目","获奖名次、等级"]
[1,"钟晓艺",2020010575,"本科","化学工程与环境学院","能源化学工程20-1","2022年中国大学生艺术体操线上赛","国家级","个人带","第一名"]
[2,"钟晓艺",2020010575,"本科","化学工程与环境学院","能源化学工程20-1","2022年中国大学生艺术体操线上赛",null,"个人圈","第一名"]
[3,"钟晓艺",2020010575,"本科","化学工程与环境学院","能源化学工程20-1",null,null,"个人球","第四名"]
{"$rows_left_out":899}
{"sheet":"社会实践先进工作者","index":4,"n_rows":26,"n_cols":5,"rows_kept":26}
["序号","先进工作者","学院","团队名称","工号"]
[{"$f":"ROW()-1","v":1},"李茂粟","安全与海洋工程学院","躬身实践启真章 同心共筑南华梦",{"$f":"VLOOKUP(B2,[2]Worksheet!$A$1:$I$2172,2,0)","v":"2019910015"}]
[2,"王心贺","石油工程学院","“求取闽宁致富经，共绘西北能源梦”社会实践团",{"$f":"VLOOKUP(B3,[2]Worksheet!$A$1:$I$2172,2,0)","v":"2021911004"}]
[3,"何洁玉","理学院","“西油记”——全面读懂中国式现代化实践团",{"$f":"VLOOKUP(B4,[2]Worksheet!$A$1:$I$2172,2,0)","v":"2022911014"}]
[4,"邵炜涛","机械与储运工程学院","“践行复信精神 打造红旅IP——‘一带一路’产教融合助力乡村振兴”实践团",2021210758]
[5,"李杰","石油工程学院","多维助力乡村振兴，绘就太行山水名城",2020880010]
[6,"金玮","新能源与材料学院","科技助力乡村振兴，打造绿色能源小镇",{"$f":"VLOOKUP(B7,[2]Worksheet!$A$1:$I$2172,2,0)","v":"2022911011"}]
[7,"肖亚楠","石油工程学院","“七秩展风华”感悟石油初心，“三年两回信”激发报国之志",{"$f":"VLOOKUP(B8,[2]Worksheet!$A$1:$I$2172,2,0)","v":"2018880007"}]
{"$rows_left_out":19}
{"sheet":"社会实践优秀个人","index":5,"n_rows":151,"n_cols":5,"rows_kept":151}
["序号","学院","团队名称","姓名","学号"]
[{"$f":"ROW()-1","v":1},"地球科学学院","大地之光·圆梦——“豫”见美丽周口，助力乡村振兴","杨荣彬",{"$f":"VLOOKUP(D2,[3]学生信息_20231227103344!$A$1:$L$55560,3,0)","v":2021010152}]
[2,"地球科学学院","大地之光·圆梦——疆油心声","姜雨彤",{"$f":"VLOOKUP(D3,[3]学生信息_20231227103344!$A$1:$L$55560,3,0)","v":2021010037}]
[3,"地球科学学院","大地之光·圆梦——赴“云岭之南”打造己衣旅游胜地带动乡村振兴","段雨杨",{"$f":"VLOOKUP(D4,[3]学生信息_20231227103344!$A$1:$L$55560,3,0)","v":2022010039}]
[4,"地球科学学院","大地之光·丰碑——党员寻访","戴昀珊",{"$f":"VLOOKUP(D5,[3]学生信息_20231227103344!$A$1:$L$55560,3,0)","v":2021010130}]
[5,"地球科学学院","大地之光·圆梦——疆油心声","冯钰森",{"$f":"VLOOKUP(D6,[3]学生信息_20231227103344!$A$1:$L$55560,3,0)","v":2021010051}]
[6,"地球科学学院","大地之光·圆梦——沐光留守，护航成长","黎飞凡",{"$f":"VLOOKUP(D7,[3]学生信息_20231227103344!$A$1:$L$55560,3,0)","v":2020010162}]
[7,"地球科学学院","大地之光·丰碑——扬红色石油精神，谱七秩芳华新篇","喻鑫",{"$f":"VLOOKUP(D8,[3]学生信息_20231227103344!$A$1:$L$55560,3,0)","v":2021010161}]
{"$rows_left_out":144}
{"sheet":"社会实践先进个人","index":6,"n_rows":21,"n_cols":5,"rows_kept":21}
["序号","所在学院","团队名称","姓名","学号"]
[{"$f":"ROW()-1","v":1},"安全与海洋工程学院","躬身实践启真章 同心共筑南华梦","李志明",{"$f":"VLOOKUP(D2,[3]学生信息_20231227103344!$A$1:$L$55560,3,0)","v":2021011254}]
[2,"石油工程学院","“求取闽宁致富经，共绘西北能源梦”社会实践团","周怡辰",{"$f":"VLOOKUP(D3,[3]学生信息_20231227103344!$A$1:$L$55560,3,0)","v":2021010287}]
[3,"理学院","“西油记”——全面读懂中国式现代化实践团","曹可滢",{"$f":"VLOOKUP(D4,[3]学生信息_20231227103344!$A$1:$L$55560,3,0)","v":2020011804}]
[4,"　理学院","“践行复信精神 打造红旅IP——‘一带一路’产教融合助力乡村振兴”实践团","陈茜",2020010062]
[5,"石油工程学院","多维助力乡村振兴，绘就太行山水名城","林子愉",{"$f":"VLOOKUP(D6,[3]学生信息_20231227103344!$A$1:$L$55560,3,0)","v":2017010200}]
[6,"新能源与材料学院","科技助力乡村振兴，打造绿色能源小镇","陈锐",2022011360]
[7,"石油工程学院","“七秩展风华”感悟石油初心，“三年两回信”激发报国之志","张安迪",{"$f":"VLOOKUP(D8,[3]学生信息_20231227103344!$A$1:$L$55560,3,0)","v":2021010217}]
{"$rows_left_out":13}